{"text_format":"1","workbook":"xlsx","n_sheets":5,"sheets":["Split Deferred Period","Lookups","Rates","LT Rates","Calculations"],"not_rendered":{"charts":1,"images":1,"macros":1,"external_links":0,"defined_names":8,"comments":0,"pivot_tables":0},"unopened":[],"bounds":{"document_bytes":16777216,"sheet_cells":100000,"rows_first":2000,"rows_last":500,"rows_between":2000,"halvings":0,"cell_chars":16384,"cell_head_chars":4096},"cells_cut":0,"cells_raw":0,"read":"whole","date_system":"1900"}

{"sheet":"Split Deferred Period","index":0,"n_rows":27,"n_cols":16,"rows_kept":27,"cut":false,"hidden":false,"merged":[[7,1,7,4],[22,9,22,12]]}
[]
[]
[]
[]
[]
[]
[]
[null,"Age v Level Premium Calculator"]
[null,"Please complete the grey boxes below:"]
[]
{"$rows_left_out":18}
{"sheet":"Lookups","index":1,"n_rows":7,"n_cols":7,"rows_kept":7,"cut":false,"hidden":true,"merged":[]}
["ST Protect",null,"Day 1",null,"1 Year",null,55]
["Breathing Space",null,"1 Week",null,"2 Years",null,60]
["LT Protect",null,"4 Weeks",null,"5 Years",null,65]
[null,null,"8 Weeks",null,null,null,70]
[null,null,"13 Weeks"]
[null,null,"26 Weeks"]
[null,null,"52 Weeks"]

{"sheet":"Rates","index":2,"n_rows":56,"n_cols":25,"rows_kept":56,"cut":false,"hidden":true,"merged":[]}
["Product","ST Protect","ST Protect","ST Protect","ST Protect","ST Protect","ST Protect","ST Protect","ST Protect","ST Protect","ST Protect","ST Protect","ST Protect","Breathing Space","Breathing Space","Breathing Space","Breathing Space","Breathing Space","Breathing Space","Breathing Space","Breathing Space","Breathing Space","Breathing Space","Breathing Space","Breathing Space"]
["Deferred Period","1 Week","1 Week","1 Week","4 Weeks","4 Weeks","4 Weeks","8 Weeks","8 Weeks","8 Weeks","13 Weeks","13 Weeks","13 Weeks","1 Week","1 Week","1 Week","4 Weeks","4 Weeks","4 Weeks","8 Weeks","8 Weeks","8 Weeks","13 Weeks","13 Weeks","13 Weeks"]
["Benefit Period","1 Year","2 Years","5 Years","1 Year","2 Years","5 Years","1 Year","2 Years","5 Years","1 Year","2 Years","5 Years","1 Year","2 Years","5 Years","1 Year","2 Years","5 Years","1 Year","2 Years","5 Years","1 Year","2 Years","5 Years"]
["Age last 1st Jan",{"$f":"CONCATENATE(B1,\" \",B2,\" \",B3)","v":"ST Protect 1 Week 1 Year"},{"$f":"CONCATENATE(C1,\" \",C2,\" \",C3)","v":"ST Protect 1 Week 2 Years"},"ST Protect 1 Week 5 Years","ST Protect 4 Weeks 1 Year","ST Protect 4 Weeks 2 Years","ST Protect 4 Weeks 5 Years","ST Protect 8 Weeks 1 Year","ST Protect 8 Weeks 2 Years","ST Protect 8 Weeks 5 Years","ST Protect 13 Weeks 1 Year","ST Protect 13 Weeks 2 Years","ST Protect 13 Weeks 5 Years","Breathing Space 1 Week 1 Year","Breathing Space 1 Week 2 Years","Breathing Space 1 Week 5 Years","Breathing Space 4 Weeks 1 Year","Breathing Space 4 Weeks 2 Years","Breathing Space 4 Weeks 5 Years","Breathing Space 8 Weeks 1 Year","Breathing Space 8 Weeks 2 Years","Breathing Space 8 Weeks 5 Years","Breathing Space 13 Weeks 1 Year","Breathing Space 13 Weeks 2 Years","Breathing Space 13 Weeks 5 Years"]
[18,1.95,2.25,2.5499999999999998,1.3,1.5,1.7,1.17,1.35,1.53,0.85,0.98,1.1100000000000001,2.93,3.23,4.13,1.95,2.15,2.75,1.76,1.94,2.48,1.27,1.4,1.79]
[19,1.95,2.25,2.5499999999999998,1.3,1.5,1.7,1.17,1.35,1.53,0.85,0.98,1.1100000000000001,2.93,3.23,4.13,1.95,2.15,2.75,1.76,1.94,2.48,1.27,1.4,1.79]
[20,1.95,2.25,2.5499999999999998,1.3,1.5,1.7,1.17,1.35,1.53,0.85,0.98,1.1100000000000001,2.93,3.23,4.13,1.95,2.15,2.75,1.76,1.94,2.48,1.27,1.4,1.79]
[21,1.95,2.25,2.5499999999999998,1.3,1.5,1.7,1.17,1.35,1.53,0.85,0.98,1.1100000000000001,2.93,3.23,4.13,1.95,2.15,2.75,1.76,1.94,2.48,1.27,1.4,1.79]
[22,1.95,2.25,2.5499999999999998,1.3,1.5,1.7,1.17,1.35,1.53,0.85,0.98,1.1100000000000001,2.93,3.23,4.13,1.95,2.15,2.75,1.76,1.94,2.48,1.27,1.4,1.79]
[23,1.95,2.25,2.5499999999999998,1.3,1.5,1.7,1.17,1.35,1.53,0.85,0.98,1.1100000000000001,2.93,3.23,4.13,1.95,2.15,2.75,1.76,1.94,2.48,1.27,1.4,1.79]
{"$rows_left_out":47}
{"sheet":"LT Rates","index":3,"n_rows":55,"n_cols":29,"rows_kept":55,"cut":false,"hidden":true,"merged":[]}
["Retirement Age",55,55,55,55,55,55,55,60,60,60,60,60,60,60,65,65,65,65,65,65,65,70,70,70,70,70,70,70]
["Deferred Period","Day 1","1 Week","4 Weeks","8 Weeks","13 Weeks","26 Weeks","52 Weeks","Day 1","1 Week","4 Weeks","8 Weeks","13 Weeks","26 Weeks","52 Weeks","Day 1","1 Week","4 Weeks","8 Weeks","13 Weeks","26 Weeks","52 Weeks","Day 1","1 Week","4 Weeks","8 Weeks","13 Weeks","26 Weeks","52 Weeks"]
["Age last 1st Jan",{"$f":"CONCATENATE(B1,\" \",B2)","v":"55 Day 1"},{"$f":"CONCATENATE(C1,\" \",C2)","v":"55 1 Week"},"55 4 Weeks","55 8 Weeks","55 13 Weeks","55 26 Weeks","55 52 Weeks",{"$f":"CONCATENATE(I1,\" \",I2)","v":"60 Day 1"},{"$f":"CONCATENATE(J1,\" \",J2)","v":"60 1 Week"},{"$f":"CONCATENATE(K1,\" \",K2)","v":"60 4 Weeks"},{"$f":"CONCATENATE(L1,\" \",L2)","v":"60 8 Weeks"},{"$f":"CONCATENATE(M1,\" \",M2)","v":"60 13 Weeks"},{"$f":"CONCATENATE(N1,\" \",N2)","v":"60 26 Weeks"},{"$f":"CONCATENATE(O1,\" \",O2)","v":"60 52 Weeks"},{"$f":"CONCATENATE(P1,\" \",P2)","v":"65 Day 1"},{"$f":"CONCATENATE(Q1,\" \",Q2)","v":"65 1 Week"},{"$f":"CONCATENATE(R1,\" \",R2)","v":"65 4 Weeks"},{"$f":"CONCATENATE(S1,\" \",S2)","v":"65 8 Weeks"},{"$f":"CONCATENATE(T1,\" \",T2)","v":"65 13 Weeks"},{"$f":"CONCATENATE(U1,\" \",U2)","v":"65 26 Weeks"},{"$f":"CONCATENATE(V1,\" \",V2)","v":"65 52 Weeks"},{"$f":"CONCATENATE(W1,\" \",W2)","v":"70 Day 1"},{"$f":"CONCATENATE(X1,\" \",X2)","v":"70 1 Week"},{"$f":"CONCATENATE(Y1,\" \",Y2)","v":"70 4 Weeks"},{"$f":"CONCATENATE(Z1,\" \",Z2)","v":"70 8 Weeks"},{"$f":"CONCATENATE(AA1,\" \",AA2)","v":"70 13 Weeks"},{"$f":"CONCATENATE(AB1,\" \",AB2)","v":"70 26 Weeks"},{"$f":"CONCATENATE(AC1,\" \",AC2)","v":"70 52 Weeks"}]
[18,3.49,3.06,2.54,2.2200000000000002,2.11,1.83,1.54,3.47,3.05,2.5299999999999998,2.21,2.11,1.82,1.53,3.47,3.05,2.52,2.21,2.1,1.81,1.53,3.52,3.09,2.56,2.25,2.14,1.84,1.55]
[19,3.49,3.06,2.54,2.2200000000000002,2.11,1.83,1.54,3.47,3.05,2.5299999999999998,2.21,2.11,1.82,1.53,3.47,3.05,2.52,2.21,2.1,1.81,1.53,3.52,3.09,2.56,2.25,2.14,1.84,1.55]
[20,3.49,3.06,2.54,2.2200000000000002,2.11,1.83,1.54,3.47,3.05,2.5299999999999998,2.21,2.11,1.82,1.53,3.47,3.05,2.52,2.21,2.1,1.81,1.53,3.52,3.09,2.56,2.25,2.14,1.84,1.55]
[21,3.49,3.06,2.54,2.2200000000000002,2.11,1.83,1.54,3.47,3.05,2.5299999999999998,2.21,2.11,1.82,1.53,3.47,3.05,2.52,2.21,2.1,1.81,1.53,3.52,3.09,2.56,2.25,2.14,1.84,1.55]
[22,3.49,3.06,2.54,2.2200000000000002,2.11,1.83,1.54,3.47,3.05,2.5299999999999998,2.21,2.11,1.82,1.53,3.47,3.05,2.52,2.21,2.1,1.81,1.53,3.52,3.09,2.56,2.25,2.14,1.84,1.55]
[23,3.49,3.06,2.54,2.2200000000000002,2.11,1.83,1.54,3.47,3.05,2.5299999999999998,2.21,2.11,1.82,1.53,3.47,3.05,2.52,2.21,2.1,1.81,1.53,3.52,3.09,2.56,2.25,2.14,1.84,1.55]
[24,3.49,3.06,2.54,2.2200000000000002,2.11,1.83,1.54,3.47,3.05,2.5299999999999998,2.21,2.11,1.82,1.53,3.47,3.05,2.52,2.21,2.1,1.81,1.53,3.52,3.09,2.56,2.25,2.14,1.84,1.55]
{"$rows_left_out":46}
{"sheet":"Calculations","index":4,"n_rows":70,"n_cols":8,"rows_kept":70,"cut":false,"hidden":true,"merged":[]}
["Month","Year","BFS Premium","Level Premium","Age","Active",null,"Total"]
[{"$f":"IF(A1=\"\",#N/A,IF('Split Deferred Period'!F$13=0,DATE(YEAR(TODAY())+1,1,1),IF(DATE(YEAR(TODAY())+1,1,1)>='Split Deferred Period'!F$13,\"\",DATE(YEAR(TODAY())+1,1,1))))","v":"2020-01-01"},{"$f":"IF(ISERROR(A2),#N/A,\"Year 1\")","v":"Year 1"},{"$f":"'Split Deferred Period'!H19","v":0},{"$f":"IF(A2=\"\",\"\",'Split Deferred Period'!D20)","v":0},{"$f":"IF(OR(A2=\"\",'Split Deferred Period'!D$12=\"\"),\"\",INT((A2-'Split Deferred Period'!D$12)/365))","v":""},"Y",{"$f":"IF(ISERROR(A2),2,IF(G1=\"\",IF(C2>D2,1,\"\"),G1))","v":""},{"$f":"IF(ISERROR(A2),2,IF(SUM(C$2:C2)>SUM(D$2:D2),1,\"\"))","v":""}]
[{"$f":"IF(A2=\"\",#N/A,IF('Split Deferred Period'!F$13=0,EOMONTH(A2,11)+1,IF(EOMONTH(A2,11)+1>='Split Deferred Period'!F$13,#N/A,EOMONTH(A2,11)+1)))","v":"2021-01-01"},{"$f":"IF(ISERROR(A3),#N/A,CONCATENATE(\"Year \",(MID(B2,MIN(IF(ISERROR(FIND({1;2;3;4;5;6;7;8;9;0},B2)),\"\",FIND({1;2;3;4;5;6;7;8;9;0},B2))),LEN(B2)-MIN(IF(ISERROR(FIND({1;2;3;4;5;6;7;8;9;0},B2)),\"\",FIND({1;2;3;4;5;6;7;8;9;0},B2)))+1))+1))","v":"Year 2"},{"$f":"IF(A3=\"\",\"\",IFERROR(IF('Split Deferred Period'!D$16=\"LT Protect\",INDEX('LT Rates'!A$3:AC$55,MATCH(E3,'LT Rates'!A$3:A$55),MATCH(IF('Split Deferred Period'!D$16=\"LT Protect\",IF(OR('Split Deferred Period'!D$17=\"\",'Split Deferred Period'!D$13=\"\"),\"\",CONCATENATE(MROUND('Split Deferred Period'!D$13,5),\" \",'Split Deferred Period'!D$17)),IF(OR('Split Deferred Period'!D$16=\"\",'Split Deferred Period'!D$17=\"\",'Split Deferred Period'!D$18=\"\"),\"\",CONCATENATE('Split Deferred Period'!D$16,\" \",'Split Deferred Period'!D$17,\" \",'Split Deferred Period'!D$18))),'LT Rates'!A$3:AC$3,0)),INDEX(Rates!A$4:Y$56,MATCH(E3,Rates!A$4:A$56),MATCH(IF('Split Deferred Period'!D$16=\"LT Protect\",IF(OR('Split Deferred Period'!D$17=\"\",'Split Deferred Period'!D$13=\"\"),\"\",CONCATENATE(MROUND('Split Deferred Period'!D$13,5),\" \",'Split Deferred Period'!D$17)),IF(OR('Split Deferred Period'!D$16=\"\",'Split Deferred Period'!D$17=\"\",'Split Deferred Period'!D$18=\"\"),\"\",CONCATENATE('Split Deferred Period'!D$16,\" \",'Split Deferred Period'!D$17,\" \",'Split Deferred Period'!D$18))),Rates!A$4:Y$4,0)))/100*(IF('Split Deferred Period'!D$19=\"\",100,'Split Deferred Period'!D$19)),0))","v":0},{"$f":"IF(A3=\"\",\"\",D2)","v":0},{"$f":"IF(OR(A3=\"\",'Split Deferred Period'!D$12=\"\"),\"\",INT((A3-'Split Deferred Period'!D$12)/365))","v":""},{"$f":"IF(A3=\"\",\"N\",\"Y\")","v":"Y"},"",{"$f":"IF(ISERROR(A3),2,IF(SUM(C$2:C3)>SUM(D$2:D3),1,\"\"))","v":""}]
[{"$f":"IF(A3=\"\",#N/A,IF('Split Deferred Period'!F$13=0,EOMONTH(A3,11)+1,IF(EOMONTH(A3,11)+1>='Split Deferred Period'!F$13,#N/A,EOMONTH(A3,11)+1)))","v":"2022-01-01"},{"$f":"IF(ISERROR(A4),#N/A,CONCATENATE(\"Year \",(MID(B3,MIN(IF(ISERROR(FIND({1;2;3;4;5;6;7;8;9;0},B3)),\"\",FIND({1;2;3;4;5;6;7;8;9;0},B3))),LEN(B3)-MIN(IF(ISERROR(FIND({1;2;3;4;5;6;7;8;9;0},B3)),\"\",FIND({1;2;3;4;5;6;7;8;9;0},B3)))+1))+1))","v":"Year 3"},{"$f":"IF(A4=\"\",\"\",IFERROR(IF('Split Deferred Period'!D$16=\"LT Protect\",INDEX('LT Rates'!A$3:AC$55,MATCH(E4,'LT Rates'!A$3:A$55),MATCH(IF('Split Deferred Period'!D$16=\"LT Protect\",IF(OR('Split Deferred Period'!D$17=\"\",'Split Deferred Period'!D$13=\"\"),\"\",CONCATENATE(MROUND('Split Deferred Period'!D$13,5),\" \",'Split Deferred Period'!D$17)),IF(OR('Split Deferred Period'!D$16=\"\",'Split Deferred Period'!D$17=\"\",'Split Deferred Period'!D$18=\"\"),\"\",CONCATENATE('Split Deferred Period'!D$16,\" \",'Split Deferred Period'!D$17,\" \",'Split Deferred Period'!D$18))),'LT Rates'!A$3:AC$3,0)),INDEX(Rates!A$4:Y$56,MATCH(E4,Rates!A$4:A$56),MATCH(IF('Split Deferred Period'!D$16=\"LT Protect\",IF(OR('Split Deferred Period'!D$17=\"\",'Split Deferred Period'!D$13=\"\"),\"\",CONCATENATE(MROUND('Split Deferred Period'!D$13,5),\" \",'Split Deferred Period'!D$17)),IF(OR('Split Deferred Period'!D$16=\"\",'Split Deferred Period'!D$17=\"\",'Split Deferred Period'!D$18=\"\"),\"\",CONCATENATE('Split Deferred Period'!D$16,\" \",'Split Deferred Period'!D$17,\" \",'Split Deferred Period'!D$18))),Rates!A$4:Y$4,0)))/100*(IF('Split Deferred Period'!D$19=\"\",100,'Split Deferred Period'!D$19)),0))","v":0},0,{"$f":"IF(OR(A4=\"\",'Split Deferred Period'!D$12=\"\"),\"\",INT((A4-'Split Deferred Period'!D$12)/365))","v":""},"Y","",{"$f":"IF(ISERROR(A4),2,IF(SUM(C$2:C4)>SUM(D$2:D4),1,\"\"))","v":""}]
[{"$f":"IF(A4=\"\",#N/A,IF('Split Deferred Period'!F$13=0,EOMONTH(A4,11)+1,IF(EOMONTH(A4,11)+1>='Split Deferred Period'!F$13,#N/A,EOMONTH(A4,11)+1)))","v":"2023-01-01"},{"$f":"IF(ISERROR(A5),#N/A,CONCATENATE(\"Year \",(MID(B4,MIN(IF(ISERROR(FIND({1;2;3;4;5;6;7;8;9;0},B4)),\"\",FIND({1;2;3;4;5;6;7;8;9;0},B4))),LEN(B4)-MIN(IF(ISERROR(FIND({1;2;3;4;5;6;7;8;9;0},B4)),\"\",FIND({1;2;3;4;5;6;7;8;9;0},B4)))+1))+1))","v":"Year 4"},{"$f":"IF(A5=\"\",\"\",IFERROR(IF('Split Deferred Period'!D$16=\"LT Protect\",INDEX('LT Rates'!A$3:AC$55,MATCH(E5,'LT Rates'!A$3:A$55),MATCH(IF('Split Deferred Period'!D$16=\"LT Protect\",IF(OR('Split Deferred Period'!D$17=\"\",'Split Deferred Period'!D$13=\"\"),\"\",CONCATENATE(MROUND('Split Deferred Period'!D$13,5),\" \",'Split Deferred Period'!D$17)),IF(OR('Split Deferred Period'!D$16=\"\",'Split Deferred Period'!D$17=\"\",'Split Deferred Period'!D$18=\"\"),\"\",CONCATENATE('Split Deferred Period'!D$16,\" \",'Split Deferred Period'!D$17,\" \",'Split Deferred Period'!D$18))),'LT Rates'!A$3:AC$3,0)),INDEX(Rates!A$4:Y$56,MATCH(E5,Rates!A$4:A$56),MATCH(IF('Split Deferred Period'!D$16=\"LT Protect\",IF(OR('Split Deferred Period'!D$17=\"\",'Split Deferred Period'!D$13=\"\"),\"\",CONCATENATE(MROUND('Split Deferred Period'!D$13,5),\" \",'Split Deferred Period'!D$17)),IF(OR('Split Deferred Period'!D$16=\"\",'Split Deferred Period'!D$17=\"\",'Split Deferred Period'!D$18=\"\"),\"\",CONCATENATE('Split Deferred Period'!D$16,\" \",'Split Deferred Period'!D$17,\" \",'Split Deferred Period'!D$18))),Rates!A$4:Y$4,0)))/100*(IF('Split Deferred Period'!D$19=\"\",100,'Split Deferred Period'!D$19)),0))","v":0},0,{"$f":"IF(OR(A5=\"\",'Split Deferred Period'!D$12=\"\"),\"\",INT((A5-'Split Deferred Period'!D$12)/365))","v":""},"Y","",{"$f":"IF(ISERROR(A5),2,IF(SUM(C$2:C5)>SUM(D$2:D5),1,\"\"))","v":""}]
[{"$f":"IF(A5=\"\",#N/A,IF('Split Deferred Period'!F$13=0,EOMONTH(A5,11)+1,IF(EOMONTH(A5,11)+1>='Split Deferred Period'!F$13,#N/A,EOMONTH(A5,11)+1)))","v":"2024-01-01"},{"$f":"IF(ISERROR(A6),#N/A,CONCATENATE(\"Year \",(MID(B5,MIN(IF(ISERROR(FIND({1;2;3;4;5;6;7;8;9;0},B5)),\"\",FIND({1;2;3;4;5;6;7;8;9;0},B5))),LEN(B5)-MIN(IF(ISERROR(FIND({1;2;3;4;5;6;7;8;9;0},B5)),\"\",FIND({1;2;3;4;5;6;7;8;9;0},B5)))+1))+1))","v":"Year 5"},{"$f":"IF(A6=\"\",\"\",IFERROR(IF('Split Deferred Period'!D$16=\"LT Protect\",INDEX('LT Rates'!A$3:AC$55,MATCH(E6,'LT Rates'!A$3:A$55),MATCH(IF('Split Deferred Period'!D$16=\"LT Protect\",IF(OR('Split Deferred Period'!D$17=\"\",'Split Deferred Period'!D$13=\"\"),\"\",CONCATENATE(MROUND('Split Deferred Period'!D$13,5),\" \",'Split Deferred Period'!D$17)),IF(OR('Split Deferred Period'!D$16=\"\",'Split Deferred Period'!D$17=\"\",'Split Deferred Period'!D$18=\"\"),\"\",CONCATENATE('Split Deferred Period'!D$16,\" \",'Split Deferred Period'!D$17,\" \",'Split Deferred Period'!D$18))),'LT Rates'!A$3:AC$3,0)),INDEX(Rates!A$4:Y$56,MATCH(E6,Rates!A$4:A$56),MATCH(IF('Split Deferred Period'!D$16=\"LT Protect\",IF(OR('Split Deferred Period'!D$17=\"\",'Split Deferred Period'!D$13=\"\"),\"\",CONCATENATE(MROUND('Split Deferred Period'!D$13,5),\" \",'Split Deferred Period'!D$17)),IF(OR('Split Deferred Period'!D$16=\"\",'Split Deferred Period'!D$17=\"\",'Split Deferred Period'!D$18=\"\"),\"\",CONCATENATE('Split Deferred Period'!D$16,\" \",'Split Deferred Period'!D$17,\" \",'Split Deferred Period'!D$18))),Rates!A$4:Y$4,0)))/100*(IF('Split Deferred Period'!D$19=\"\",100,'Split Deferred Period'!D$19)),0))","v":0},0,{"$f":"IF(OR(A6=\"\",'Split Deferred Period'!D$12=\"\"),\"\",INT((A6-'Split Deferred Period'!D$12)/365))","v":""},"Y","",{"$f":"IF(ISERROR(A6),2,IF(SUM(C$2:C6)>SUM(D$2:D6),1,\"\"))","v":""}]
[{"$f":"IF(A6=\"\",#N/A,IF('Split Deferred Period'!F$13=0,EOMONTH(A6,11)+1,IF(EOMONTH(A6,11)+1>='Split Deferred Period'!F$13,#N/A,EOMONTH(A6,11)+1)))","v":"2025-01-01"},{"$f":"IF(ISERROR(A7),#N/A,CONCATENATE(\"Year \",(MID(B6,MIN(IF(ISERROR(FIND({1;2;3;4;5;6;7;8;9;0},B6)),\"\",FIND({1;2;3;4;5;6;7;8;9;0},B6))),LEN(B6)-MIN(IF(ISERROR(FIND({1;2;3;4;5;6;7;8;9;0},B6)),\"\",FIND({1;2;3;4;5;6;7;8;9;0},B6)))+1))+1))","v":"Year 6"},{"$f":"IF(A7=\"\",\"\",IFERROR(IF('Split Deferred Period'!D$16=\"LT Protect\",INDEX('LT Rates'!A$3:AC$55,MATCH(E7,'LT Rates'!A$3:A$55),MATCH(IF('Split Deferred Period'!D$16=\"LT Protect\",IF(OR('Split Deferred Period'!D$17=\"\",'Split Deferred Period'!D$13=\"\"),\"\",CONCATENATE(MROUND('Split Deferred Period'!D$13,5),\" \",'Split Deferred Period'!D$17)),IF(OR('Split Deferred Period'!D$16=\"\",'Split Deferred Period'!D$17=\"\",'Split Deferred Period'!D$18=\"\"),\"\",CONCATENATE('Split Deferred Period'!D$16,\" \",'Split Deferred Period'!D$17,\" \",'Split Deferred Period'!D$18))),'LT Rates'!A$3:AC$3,0)),INDEX(Rates!A$4:Y$56,MATCH(E7,Rates!A$4:A$56),MATCH(IF('Split Deferred Period'!D$16=\"LT Protect\",IF(OR('Split Deferred Period'!D$17=\"\",'Split Deferred Period'!D$13=\"\"),\"\",CONCATENATE(MROUND('Split Deferred Period'!D$13,5),\" \",'Split Deferred Period'!D$17)),IF(OR('Split Deferred Period'!D$16=\"\",'Split Deferred Period'!D$17=\"\",'Split Deferred Period'!D$18=\"\"),\"\",CONCATENATE('Split Deferred Period'!D$16,\" \",'Split Deferred Period'!D$17,\" \",'Split Deferred Period'!D$18))),Rates!A$4:Y$4,0)))/100*(IF('Split Deferred Period'!D$19=\"\",100,'Split Deferred Period'!D$19)),0))","v":0},0,{"$f":"IF(OR(A7=\"\",'Split Deferred Period'!D$12=\"\"),\"\",INT((A7-'Split Deferred Period'!D$12)/365))","v":""},"Y","",{"$f":"IF(ISERROR(A7),2,IF(SUM(C$2:C7)>SUM(D$2:D7),1,\"\"))","v":""}]
[{"$f":"IF(A7=\"\",#N/A,IF('Split Deferred Period'!F$13=0,EOMONTH(A7,11)+1,IF(EOMONTH(A7,11)+1>='Split Deferred Period'!F$13,#N/A,EOMONTH(A7,11)+1)))","v":"2026-01-01"},{"$f":"IF(ISERROR(A8),#N/A,CONCATENATE(\"Year \",(MID(B7,MIN(IF(ISERROR(FIND({1;2;3;4;5;6;7;8;9;0},B7)),\"\",FIND({1;2;3;4;5;6;7;8;9;0},B7))),LEN(B7)-MIN(IF(ISERROR(FIND({1;2;3;4;5;6;7;8;9;0},B7)),\"\",FIND({1;2;3;4;5;6;7;8;9;0},B7)))+1))+1))","v":"Year 7"},{"$f":"IF(A8=\"\",\"\",IFERROR(IF('Split Deferred Period'!D$16=\"LT Protect\",INDEX('LT Rates'!A$3:AC$55,MATCH(E8,'LT Rates'!A$3:A$55),MATCH(IF('Split Deferred Period'!D$16=\"LT Protect\",IF(OR('Split Deferred Period'!D$17=\"\",'Split Deferred Period'!D$13=\"\"),\"\",CONCATENATE(MROUND('Split Deferred Period'!D$13,5),\" \",'Split Deferred Period'!D$17)),IF(OR('Split Deferred Period'!D$16=\"\",'Split Deferred Period'!D$17=\"\",'Split Deferred Period'!D$18=\"\"),\"\",CONCATENATE('Split Deferred Period'!D$16,\" \",'Split Deferred Period'!D$17,\" \",'Split Deferred Period'!D$18))),'LT Rates'!A$3:AC$3,0)),INDEX(Rates!A$4:Y$56,MATCH(E8,Rates!A$4:A$56),MATCH(IF('Split Deferred Period'!D$16=\"LT Protect\",IF(OR('Split Deferred Period'!D$17=\"\",'Split Deferred Period'!D$13=\"\"),\"\",CONCATENATE(MROUND('Split Deferred Period'!D$13,5),\" \",'Split Deferred Period'!D$17)),IF(OR('Split Deferred Period'!D$16=\"\",'Split Deferred Period'!D$17=\"\",'Split Deferred Period'!D$18=\"\"),\"\",CONCATENATE('Split Deferred Period'!D$16,\" \",'Split Deferred Period'!D$17,\" \",'Split Deferred Period'!D$18))),Rates!A$4:Y$4,0)))/100*(IF('Split Deferred Period'!D$19=\"\",100,'Split Deferred Period'!D$19)),0))","v":0},0,{"$f":"IF(OR(A8=\"\",'Split Deferred Period'!D$12=\"\"),\"\",INT((A8-'Split Deferred Period'!D$12)/365))","v":""},"Y","",{"$f":"IF(ISERROR(A8),2,IF(SUM(C$2:C8)>SUM(D$2:D8),1,\"\"))","v":""}]
[{"$f":"IF(A8=\"\",#N/A,IF('Split Deferred Period'!F$13=0,EOMONTH(A8,11)+1,IF(EOMONTH(A8,11)+1>='Split Deferred Period'!F$13,#N/A,EOMONTH(A8,11)+1)))","v":"2027-01-01"},{"$f":"IF(ISERROR(A9),#N/A,CONCATENATE(\"Year \",(MID(B8,MIN(IF(ISERROR(FIND({1;2;3;4;5;6;7;8;9;0},B8)),\"\",FIND({1;2;3;4;5;6;7;8;9;0},B8))),LEN(B8)-MIN(IF(ISERROR(FIND({1;2;3;4;5;6;7;8;9;0},B8)),\"\",FIND({1;2;3;4;5;6;7;8;9;0},B8)))+1))+1))","v":"Year 8"},{"$f":"IF(A9=\"\",\"\",IFERROR(IF('Split Deferred Period'!D$16=\"LT Protect\",INDEX('LT Rates'!A$3:AC$55,MATCH(E9,'LT Rates'!A$3:A$55),MATCH(IF('Split Deferred Period'!D$16=\"LT Protect\",IF(OR('Split Deferred Period'!D$17=\"\",'Split Deferred Period'!D$13=\"\"),\"\",CONCATENATE(MROUND('Split Deferred Period'!D$13,5),\" \",'Split Deferred Period'!D$17)),IF(OR('Split Deferred Period'!D$16=\"\",'Split Deferred Period'!D$17=\"\",'Split Deferred Period'!D$18=\"\"),\"\",CONCATENATE('Split Deferred Period'!D$16,\" \",'Split Deferred Period'!D$17,\" \",'Split Deferred Period'!D$18))),'LT Rates'!A$3:AC$3,0)),INDEX(Rates!A$4:Y$56,MATCH(E9,Rates!A$4:A$56),MATCH(IF('Split Deferred Period'!D$16=\"LT Protect\",IF(OR('Split Deferred Period'!D$17=\"\",'Split Deferred Period'!D$13=\"\"),\"\",CONCATENATE(MROUND('Split Deferred Period'!D$13,5),\" \",'Split Deferred Period'!D$17)),IF(OR('Split Deferred Period'!D$16=\"\",'Split Deferred Period'!D$17=\"\",'Split Deferred Period'!D$18=\"\"),\"\",CONCATENATE('Split Deferred Period'!D$16,\" \",'Split Deferred Period'!D$17,\" \",'Split Deferred Period'!D$18))),Rates!A$4:Y$4,0)))/100*(IF('Split Deferred Period'!D$19=\"\",100,'Split Deferred Period'!D$19)),0))","v":0},0,{"$f":"IF(OR(A9=\"\",'Split Deferred Period'!D$12=\"\"),\"\",INT((A9-'Split Deferred Period'!D$12)/365))","v":""},"Y","",{"$f":"IF(ISERROR(A9),2,IF(SUM(C$2:C9)>SUM(D$2:D9),1,\"\"))","v":""}]
[{"$f":"IF(A9=\"\",#N/A,IF('Split Deferred Period'!F$13=0,EOMONTH(A9,11)+1,IF(EOMONTH(A9,11)+1>='Split Deferred Period'!F$13,#N/A,EOMONTH(A9,11)+1)))","v":"2028-01-01"},{"$f":"IF(ISERROR(A10),#N/A,CONCATENATE(\"Year \",(MID(B9,MIN(IF(ISERROR(FIND({1;2;3;4;5;6;7;8;9;0},B9)),\"\",FIND({1;2;3;4;5;6;7;8;9;0},B9))),LEN(B9)-MIN(IF(ISERROR(FIND({1;2;3;4;5;6;7;8;9;0},B9)),\"\",FIND({1;2;3;4;5;6;7;8;9;0},B9)))+1))+1))","v":"Year 9"},{"$f":"IF(A10=\"\",\"\",IFERROR(IF('Split Deferred Period'!D$16=\"LT Protect\",INDEX('LT Rates'!A$3:AC$55,MATCH(E10,'LT Rates'!A$3:A$55),MATCH(IF('Split Deferred Period'!D$16=\"LT Protect\",IF(OR('Split Deferred Period'!D$17=\"\",'Split Deferred Period'!D$13=\"\"),\"\",CONCATENATE(MROUND('Split Deferred Period'!D$13,5),\" \",'Split Deferred Period'!D$17)),IF(OR('Split Deferred Period'!D$16=\"\",'Split Deferred Period'!D$17=\"\",'Split Deferred Period'!D$18=\"\"),\"\",CONCATENATE('Split Deferred Period'!D$16,\" \",'Split Deferred Period'!D$17,\" \",'Split Deferred Period'!D$18))),'LT Rates'!A$3:AC$3,0)),INDEX(Rates!A$4:Y$56,MATCH(E10,Rates!A$4:A$56),MATCH(IF('Split Deferred Period'!D$16=\"LT Protect\",IF(OR('Split Deferred Period'!D$17=\"\",'Split Deferred Period'!D$13=\"\"),\"\",CONCATENATE(MROUND('Split Deferred Period'!D$13,5),\" \",'Split Deferred Period'!D$17)),IF(OR('Split Deferred Period'!D$16=\"\",'Split Deferred Period'!D$17=\"\",'Split Deferred Period'!D$18=\"\"),\"\",CONCATENATE('Split Deferred Period'!D$16,\" \",'Split Deferred Period'!D$17,\" \",'Split Deferred Period'!D$18))),Rates!A$4:Y$4,0)))/100*(IF('Split Deferred Period'!D$19=\"\",100,'Split Deferred Period'!D$19)),0))","v":0},0,{"$f":"IF(OR(A10=\"\",'Split Deferred Period'!D$12=\"\"),\"\",INT((A10-'Split Deferred Period'!D$12)/365))","v":""},"Y","",{"$f":"IF(ISERROR(A10),2,IF(SUM(C$2:C10)>SUM(D$2:D10),1,\"\"))","v":""}]
{"$rows_left_out":60}